Reaction Details
TargetG2/mitotic-specific cyclin-B1
LigandBDBM43757
Substrate/Competitorn/a
Meas. Tech.Counterscreen assay for inhibitors of Wee1 degradation: dose response cell-based assay to identify inhibitors of cyclin B degradation
EC50>49750±n/a nM
Citation PubChem, PC Counterscreen assay for inhibitors of Wee1 degradation: dose response cell-based assay to identify inhibitors of cyclin B degradation PubChem Bioassay(2008)[AID]
 
G2/mitotic-specific cyclin-B1
Name:G2/mitotic-specific cyclin-B1
Type:Enzyme Subunit
Mol. Mass.:48340.95
Organism:Homo sapiens (Human)
Description:P14635
Residue:433
BDBM43757
NameBDBM43757
Synonyms:2-furanyl-(8-methyl-2-sulfanylidene-[1,2,4]triazolo[1,5-a]pyridin-3-yl)methanone Furan-2-yl-(8-methyl-2-thioxo-2H-[1,2,4]triazolo[1,5-a]pyridin-3-yl)-methanone SMR000146487 furan-2-yl-(8-methyl-2-sulfanylidene-[1,2,4]triazolo[1,5-a]pyridin-3-yl)methanone
TypeSmall organic molecule
Emp. Form.C12H9N3O2S
Mol. Mass.259.284
SMILESCc1cccn2n(C(=O)c3ccco3)c(=S)nc12