Reaction Details
TargetG2/mitotic-specific cyclin-B1
LigandBDBM43763
Substrate/Competitorn/a
Meas. Tech.Counterscreen assay for inhibitors of Wee1 degradation: dose response cell-based assay to identify inhibitors of cyclin B degradation
EC50>49750±n/a nM
Citation PubChem, PC Counterscreen assay for inhibitors of Wee1 degradation: dose response cell-based assay to identify inhibitors of cyclin B degradation PubChem Bioassay(2008)[AID]
 
G2/mitotic-specific cyclin-B1
Name:G2/mitotic-specific cyclin-B1
Type:Enzyme Subunit
Mol. Mass.:48340.95
Organism:Homo sapiens (Human)
Description:P14635
Residue:433
BDBM43763
NameBDBM43763
Synonyms:4,5-Dimethoxy-1H-indole-2-carboxylic acid [1-(2,3-dimethoxy-phenyl)-meth-(E)-ylidene]-hydrazide N-[(2,3-dimethoxybenzylidene)amino]-4,5-dimethoxy-1H-indole-2-carboxamide SMR000221624 | cid_1963601
TypeSmall organic molecule
Emp. Form.C20H21N3O5
Mol. Mass.383.3978
SMILESCOc1cccc(C=NNC(=O)c2cc3c(OC)c(OC)ccc3[nH]2)c1OC