Reaction Details
TargetG2/mitotic-specific cyclin-B1
LigandBDBM43767
Substrate/Competitorn/a
Meas. Tech.Counterscreen assay for inhibitors of Wee1 degradation: dose response cell-based assay to identify inhibitors of cyclin B degradation
EC50>49750±n/a nM
Citation PubChem, PC Counterscreen assay for inhibitors of Wee1 degradation: dose response cell-based assay to identify inhibitors of cyclin B degradation PubChem Bioassay(2008)[AID]
 
G2/mitotic-specific cyclin-B1
Name:G2/mitotic-specific cyclin-B1
Type:Enzyme Subunit
Mol. Mass.:48340.95
Organism:Homo sapiens (Human)
Description:P14635
Residue:433
BDBM43767
NameBDBM43767
Synonyms:2-[4-(4-fluorobenzoyl)phenoxy]-N-(4-fluorobenzyl)acetamide 2-[4-(4-fluorophenyl)carbonylphenoxy]-N-[(4-fluorophenyl)methyl]ethanamide N-[(4-fluorophenyl)methyl]-2-[4-[(4-fluorophenyl)-oxomethyl]phenoxy]acetamide cid_2564901
TypeSmall organic molecule
Emp. Form.C22H17F2NO3
Mol. Mass.381.3721
SMILESFc1ccc(CNC(=O)COc2ccc(cc2)C(=O)c2ccc(F)cc2)cc1