Reaction Details
TargetG2/mitotic-specific cyclin-B1
LigandBDBM43774
Substrate/Competitorn/a
Meas. Tech.Counterscreen assay for inhibitors of Wee1 degradation: dose response cell-based assay to identify inhibitors of cyclin B degradation
EC50>49750±n/a nM
Citation PubChem, PC Counterscreen assay for inhibitors of Wee1 degradation: dose response cell-based assay to identify inhibitors of cyclin B degradation PubChem Bioassay(2008)[AID]
 
G2/mitotic-specific cyclin-B1
Name:G2/mitotic-specific cyclin-B1
Type:Enzyme Subunit
Mol. Mass.:48340.95
Organism:Homo sapiens (Human)
Description:P14635
Residue:433
BDBM43774
NameBDBM43774
Synonyms:MLS001017252 N-[4-[(1,3-benzothiazol-2-ylhydrazinylidene)methyl]phenyl]ethanamide N-[4-[(E)-(1,3-benzothiazol-2-ylhydrazono)methyl]phenyl]acetamide cid_220697
TypeSmall organic molecule
Emp. Form.C16H14N4OS
Mol. Mass.310.374
SMILESCC(=O)Nc1ccc(CN=Nc2nc3ccccc3s2)cc1