Reaction Details
TargetG2/mitotic-specific cyclin-B1
LigandBDBM43778
Substrate/Competitorn/a
Meas. Tech.Counterscreen assay for inhibitors of Wee1 degradation: dose response cell-based assay to identify inhibitors of cyclin B degradation
EC50>49750±n/a nM
Citation PubChem, PC Counterscreen assay for inhibitors of Wee1 degradation: dose response cell-based assay to identify inhibitors of cyclin B degradation PubChem Bioassay(2008)[AID]
 
G2/mitotic-specific cyclin-B1
Name:G2/mitotic-specific cyclin-B1
Type:Enzyme Subunit
Mol. Mass.:48340.95
Organism:Homo sapiens (Human)
Description:P14635
Residue:433
BDBM43778
NameBDBM43778
Synonyms:2-[4-(3,4-dimethylthieno[2,3-b]thiophen-5-yl)pyrimidin-2-yl]sulfanyl-N-(phenylmethyl)ethanamide MLS000860689 N-benzyl-2-[[4-(3,4-dimethylthieno[2,3-b]thiophen-5-yl)pyrimidin-2-yl]thio]acetamide SMR000459473 | cid_2820576
TypeSmall organic molecule
Emp. Form.C21H19N3OS3
Mol. Mass.425.59
SMILESCc1csc2sc(c(C)c12)-c1ccnc(SCC(=O)NCc2ccccc2)n1