Reaction Details
TargetPhosphotransferase
LigandBDBM43829
Substrate/Competitorn/a
Meas. Tech.Inhibition Assay
Temperature298.15±0 K
Ki 1.00e+5± 1e+3 nM
IC50 6000000±0.0 nM
Citation Willson, MSanejouand, YHPerie, JHannaert, VOpperdoes, F Sequencing, modeling, and selective inhibition of Trypanosoma brucei hexokinase. Chem Biol9:839-47 (2002) 
 
Phosphotransferase
Name:Phosphotransferase
Synonyms:Hexokinase
Type:Protein
Mol. Mass.:51306.14
Organism:Trypanosoma brucei
Description:Q38C42
Residue:471
BDBM43829
NameBDBM43829
TypeSmall organic molecule
Emp. Form.C20H19N3O2
Mol. Mass.333.3838
SMILESOc1ccccc1N1CCN(CC1)C(=O)c1ccc2ccccc2n1