Reaction Details
TargetPhosphotransferase
LigandBDBM43835
Substrate/Competitorn/a
Meas. Tech.Inhibition Assay
Temperature298.15±0 K
Ki 2.8e+3± 1e+2 nM
IC50 500000±0.0 nM
Citation Willson, MSanejouand, YHPerie, JHannaert, VOpperdoes, F Sequencing, modeling, and selective inhibition of Trypanosoma brucei hexokinase. Chem Biol9:839-47 (2002) 
 
Phosphotransferase
Name:Phosphotransferase
Synonyms:Hexokinase
Type:Protein
Mol. Mass.:51306.14
Organism:Trypanosoma brucei
Description:Q38C42
Residue:471
BDBM43835
NameBDBM43835
TypeSmall organic molecule
Emp. Form.C18H25N3O3
Mol. Mass.331.4094
SMILES[O-][N+](=O)c1ccc(N2CCCCC2)c(c1)C(=O)NC1CCCCC1