Reaction Details
TargetPhosphotransferase
LigandBDBM43837
Substrate/Competitorn/a
Meas. Tech.Inhibition Assay
Temperature298.15±0 K
Ki 7.0e+4± 1e+3 nM
IC50 3000000±0.0 nM
Citation Willson, MSanejouand, YHPerie, JHannaert, VOpperdoes, F Sequencing, modeling, and selective inhibition of Trypanosoma brucei hexokinase. Chem Biol9:839-47 (2002) 
 
Phosphotransferase
Name:Phosphotransferase
Synonyms:Hexokinase
Type:Protein
Mol. Mass.:51306.14
Organism:Trypanosoma brucei
Description:Q38C42
Residue:471
BDBM43837
NameBDBM43837
TypeSmall organic molecule
Emp. Form.C19H26N2O5
Mol. Mass.362.4201
SMILESCCOC(=O)CN1[C@H](C)[C@@H]([C@H](CCc2ccccc2)NC1=O)C(=O)OC