Reaction Details
TargetHIV-1 protease
LigandBDBM586099
Substrate/Competitorn/a
Meas. Tech.Inhibition Assay
pH5.6±0
Temperature310.15±0 K
Ki 1.5±0.0 nM
Citation Brik, ALin, YCElder, JWong, CH A quick diversity-oriented amide-forming reaction to optimize P-subsite residues of HIV protease inhibitors. Chem Biol9:891-6 (2002) 
 
HIV-1 protease
Name:HIV-1 protease
Synonyms:HIV-1 protease wild type
Type:Protein
Mol. Mass.:10757.68
Organism:Human immunodeficiency virus
Description:O90785
Residue:99
BDBM586099
NameBDBM586099
Typen/a
Emp. Form.C44H54N4O8
Mol. Mass.766.9216
SMILESCC(C)[C@H](NC(=O)OCc1ccccc1)C(=O)N[C@@H](Cc1ccccc1)[C@@H](O)[C@H](O)[C@H](Cc1ccccc1)NC(=O)[C@@H](NC(=O)OCc1ccccc1)C(C)C