Reaction Details
TargetGlycylpeptide N-tetradecanoyltransferase
LigandBDBM50109879
Substrate/CompetitorBDBM43857
Meas. Tech.Inhibition Assay
IC50 4±n/a nM
Citation Sogabe, SMasubuchi, MSakata, KFukami, TAMorikami, KShiratori, YEbiike, HKawasaki, KAoki, YShimma, ND'Arcy, AWinkler, FKBanner, DWOhtsuka, T Crystal structures of Candida albicans N-myristoyltransferase with two distinct inhibitors. Chem Biol9:1119-28 (2002) 
 
Glycylpeptide N-tetradecanoyltransferase
Name:Glycylpeptide N-tetradecanoyltransferase
Type:Enzyme
Mol. Mass.:51875.96
Organism:Candida albicans (Yeast)
Description:P30418
Residue:451
BDBM50109879
BDBM43857
NameBDBM50109879
Synonyms:CHEMBL155301 {3-[2-(2,3-Difluoro-phenoxymethyl)-3-methyl-benzofuran-4-yloxy]-propyl}-pyridin-3-ylmethyl-amine
TypeSmall organic molecule
Emp. Form.C25H24F2N2O3
Mol. Mass.438.4665
SMILESCc1c(COc2cccc(F)c2F)oc2cccc(OCCCNCc3cccnc3)c12