Reaction Details
TargetGlycylpeptide N-tetradecanoyltransferase 1
LigandBDBM96235
Substrate/Competitorn/a
Meas. Tech.Inhibition Assay
IC50 1.94e+5±n/a nM
Citation Sogabe, SMasubuchi, MSakata, KFukami, TAMorikami, KShiratori, YEbiike, HKawasaki, KAoki, YShimma, ND'Arcy, AWinkler, FKBanner, DWOhtsuka, T Crystal structures of Candida albicans N-myristoyltransferase with two distinct inhibitors. Chem Biol9:1119-28 (2002) 
 
Glycylpeptide N-tetradecanoyltransferase 1
Name:Glycylpeptide N-tetradecanoyltransferase 1
Type:Enzyme
Mol. Mass.:56814.10
Organism:Homo sapiens (Human)
Description:P30419
Residue:496
BDBM96235
NameBDBM96235
Synonyms:4-[2-hydroxy-3-(isopropylamino)propoxy]-3-methyl-coumarilic acid ethyl ester;hydrochloride CHEMBL53849 Non peptidic, 1 cid_6602742 ethyl 4-[2-hydroxy-3-(propan-2-ylamino)propoxy]-3-methyl-1-benzofuran-2-carboxylate;hydrochloride
TypeSmall organic molecule
Emp. Form.C18H25NO5
Mol. Mass.335.3948
SMILESCCOC(=O)c1oc2cccc(OCC(O)CNC(C)C)c2c1C