Reaction Details
TargetGlycylpeptide N-tetradecanoyltransferase 1
LigandBDBM43855
Substrate/Competitorn/a
Meas. Tech.Inhibition Assay
IC50>5.70e+5±n/a nM
Citation Sogabe, SMasubuchi, MSakata, KFukami, TAMorikami, KShiratori, YEbiike, HKawasaki, KAoki, YShimma, ND'Arcy, AWinkler, FKBanner, DWOhtsuka, T Crystal structures of Candida albicans N-myristoyltransferase with two distinct inhibitors. Chem Biol9:1119-28 (2002) 
 
Glycylpeptide N-tetradecanoyltransferase 1
Name:Glycylpeptide N-tetradecanoyltransferase 1
Type:Enzyme
Mol. Mass.:56814.10
Organism:Homo sapiens (Human)
Description:P30419
Residue:496
BDBM43855
NameBDBM43855
Synonyms:MLS000761278 N-[4-(3,4,5,6-tetrahydro-2H-azepin-7-ylsulfamoyl)phenyl]-2,3-dihydro-1,4-benzodioxine-3-carboxamide SMR000369586 | cid_3282755
TypeSmall organic molecule
Emp. Form.C21H23N3O5S
Mol. Mass.429.489
SMILESO=C(Nc1ccc(cc1)S(=O)(=O)NC1=NCCCCC1)C1COc2ccccc2O1