Reaction Details
TargetGlycylpeptide N-tetradecanoyltransferase
LigandBDBM43854
Substrate/Competitorn/a
Meas. Tech.Inhibition Assay
Ki 1.8e+3±n/a nM
Citation Sogabe, SMasubuchi, MSakata, KFukami, TAMorikami, KShiratori, YEbiike, HKawasaki, KAoki, YShimma, ND'Arcy, AWinkler, FKBanner, DWOhtsuka, T Crystal structures of Candida albicans N-myristoyltransferase with two distinct inhibitors. Chem Biol9:1119-28 (2002) 
 
Glycylpeptide N-tetradecanoyltransferase
Name:Glycylpeptide N-tetradecanoyltransferase
Type:Enzyme
Mol. Mass.:51875.96
Organism:Candida albicans (Yeast)
Description:P30418
Residue:451
BDBM43854
NameBDBM43854
Synonyms:2-[(veratroylhydrazono)methyl]benzoic acid 2-[[(3,4-dimethoxyphenyl)carbonylhydrazinylidene]methyl]benzoic acid MLS000774113 SMR000365110 | cid_958176
TypeSmall organic molecule
Emp. Form.C17H16N2O5
Mol. Mass.328.3193
SMILESCOc1ccc(cc1OC)C(=O)NN=Cc1ccccc1C(O)=O