Reaction Details
TargetGlycylpeptide N-tetradecanoyltransferase
LigandBDBM96235
Substrate/Competitorn/a
Meas. Tech.Inhibition Assay
Ki 3.6e+2±n/a nM
Citation Sogabe, SMasubuchi, MSakata, KFukami, TAMorikami, KShiratori, YEbiike, HKawasaki, KAoki, YShimma, ND'Arcy, AWinkler, FKBanner, DWOhtsuka, T Crystal structures of Candida albicans N-myristoyltransferase with two distinct inhibitors. Chem Biol9:1119-28 (2002) 
 
Glycylpeptide N-tetradecanoyltransferase
Name:Glycylpeptide N-tetradecanoyltransferase
Type:Enzyme
Mol. Mass.:51875.96
Organism:Candida albicans (Yeast)
Description:P30418
Residue:451
BDBM96235
NameBDBM96235
Synonyms:4-[2-hydroxy-3-(isopropylamino)propoxy]-3-methyl-coumarilic acid ethyl ester;hydrochloride CHEMBL53849 Non peptidic, 1 cid_6602742 ethyl 4-[2-hydroxy-3-(propan-2-ylamino)propoxy]-3-methyl-1-benzofuran-2-carboxylate;hydrochloride
TypeSmall organic molecule
Emp. Form.C18H25NO5
Mol. Mass.335.3948
SMILESCCOC(=O)c1oc2cccc(OCC(O)CNC(C)C)c2c1C