Reaction Details
TargetGlycylpeptide N-tetradecanoyltransferase
LigandBDBM43856
Substrate/Competitorn/a
Meas. Tech.Inhibition Assay
Ki 2e+1±n/a nM
Citation Sogabe, SMasubuchi, MSakata, KFukami, TAMorikami, KShiratori, YEbiike, HKawasaki, KAoki, YShimma, ND'Arcy, AWinkler, FKBanner, DWOhtsuka, T Crystal structures of Candida albicans N-myristoyltransferase with two distinct inhibitors. Chem Biol9:1119-28 (2002) 
 
Glycylpeptide N-tetradecanoyltransferase
Name:Glycylpeptide N-tetradecanoyltransferase
Type:Enzyme
Mol. Mass.:51875.96
Organism:Candida albicans (Yeast)
Description:P30418
Residue:451
BDBM43856
NameBDBM43856
Synonyms:4-ethoxy-N-[(6-fluoro-1,1-diketo-2,3-dihydrothiochromen-4-ylidene)amino]benzenesulfonamide 4-ethoxy-N-[(6-fluoro-1,1-dioxo-2,3-dihydrothiochromen-4-ylidene)amino]benzenesulfonamide MLS000761277 SMR000369580 | cid_3596078
TypeSmall organic molecule
Emp. Form.C17H17FN2O5S2
Mol. Mass.412.456
SMILESCCOc1ccc(cc1)S(=O)(=O)NN=C1CCS(=O)(=O)c2ccc(F)cc12