Reaction Details
TargetSolute carrier family 12 member 5
LigandBDBM43890
Substrate/Competitorn/a
Meas. Tech.Identification of Novel Modulators of Cl- dependent Transport Process via HTS: Rubidium Flux
IC50 1500±n/a nM
Citation PubChem, PC Identification of Novel Modulators of Cl- dependent Transport Process via HTS: Rubidium Flux PubChem Bioassay(2009)[AID]
 
Solute carrier family 12 member 5
Name:Solute carrier family 12 member 5
Type:PROTEIN
Mol. Mass.:126185.18
Organism:Homo sapiens (Human)
Description:ChEMBL_828024
Residue:1139
BDBM43890
NameBDBM43890
Synonyms:(4-benzylpiperazin-1-yl)-(4-nitro-5-propan-2-yl-1,2-oxazol-3-yl)methanone (4-nitro-5-propan-2-yl-1,2-oxazol-3-yl)-[4-(phenylmethyl)piperazin-1-yl]methanone VU0248911-2-D3 | cid_15945538
TypeSmall organic molecule
Emp. Form.C18H22N4O4
Mol. Mass.358.3917
SMILESCC(C)c1onc(C(=O)N2CCN(Cc3ccccc3)CC2)c1[N+]([O-])=O