Reaction Details
TargetSolute carrier family 12 member 5
LigandBDBM43893
Substrate/Competitorn/a
Meas. Tech.Identification of Novel Modulators of Cl- dependent Transport Process via HTS: Rubidium Flux
IC50 1200±n/a nM
Citation PubChem, PC Identification of Novel Modulators of Cl- dependent Transport Process via HTS: Rubidium Flux PubChem Bioassay(2009)[AID]
 
Solute carrier family 12 member 5
Name:Solute carrier family 12 member 5
Type:PROTEIN
Mol. Mass.:126185.18
Organism:Homo sapiens (Human)
Description:ChEMBL_828024
Residue:1139
BDBM43893
NameBDBM43893
Synonyms:3-benzyl-6-[2-(4-chlorophenyl)-2-keto-ethyl]triazolo[4,5-d]pyrimidin-7-one 6-[2-(4-chlorophenyl)-2-oxidanylidene-ethyl]-3-(phenylmethyl)-[1,2,3]triazolo[4,5-d]pyrimidin-7-one VU0152791-2-D6 | cid_5310497
TypeSmall organic molecule
Emp. Form.C19H14ClN5O2
Mol. Mass.379.8
SMILESClc1ccc(cc1)C(=O)Cn1cnc2n(Cc3ccccc3)nnc2c1=O