Reaction Details
TargetSolute carrier family 12 member 5
LigandBDBM39676
Substrate/Competitorn/a
Meas. Tech.Identification of Novel Modulators of Cl- dependent Transport Process via HTS: Rubidium Flux
IC50 9100±n/a nM
Citation PubChem, PC Identification of Novel Modulators of Cl- dependent Transport Process via HTS: Rubidium Flux PubChem Bioassay(2009)[AID]
 
Solute carrier family 12 member 5
Name:Solute carrier family 12 member 5
Type:PROTEIN
Mol. Mass.:126185.18
Organism:Homo sapiens (Human)
Description:ChEMBL_828024
Residue:1139
BDBM39676
NameBDBM39676
Synonyms:1-N,3-N-dibenzyl-4-chlorobenzene-1,3-disulfonamide 4-chloro-N1,N3-bis(phenylmethyl)benzene-1,3-disulfonamide N,N'-dibenzyl-4-chloro-1,3-benzenedisulfonamide SMR000135505 | cid_1356376
TypeSmall organic molecule
Emp. Form.C20H19ClN2O4S2
Mol. Mass.450.959
SMILESClc1ccc(cc1S(=O)(=O)NCc1ccccc1)S(=O)(=O)NCc1ccccc1