Reaction Details
TargetSolute carrier family 12 member 5
LigandBDBM43902
Substrate/Competitorn/a
Meas. Tech.Identification of Novel Modulators of Cl- dependent Transport Process via HTS: Rubidium Flux
IC50 640±n/a nM
Citation PubChem, PC Identification of Novel Modulators of Cl- dependent Transport Process via HTS: Rubidium Flux PubChem Bioassay(2009)[AID]
 
Solute carrier family 12 member 5
Name:Solute carrier family 12 member 5
Type:PROTEIN
Mol. Mass.:126185.18
Organism:Homo sapiens (Human)
Description:ChEMBL_828024
Residue:1139
BDBM43902
NameBDBM43902
Synonyms:1-(1-benzofuran-2-yl)-2-[[5-(3,4-dimethylanilino)-1,3,4-thiadiazol-2-yl]sulfanyl]ethanone 1-(2-benzofuranyl)-2-[[5-(3,4-dimethylanilino)-1,3,4-thiadiazol-2-yl]thio]ethanone VU0278281-2-D19 | cid_2339967
TypeSmall organic molecule
Emp. Form.C20H17N3O2S2
Mol. Mass.395.498
SMILESCc1ccc(Nc2nnc(SCC(=O)c3cc4ccccc4o3)s2)cc1C