Reaction Details
TargetSolute carrier family 12 member 5
LigandBDBM43905
Substrate/Competitorn/a
Meas. Tech.Identification of Novel Modulators of Cl- dependent Transport Process via HTS: Rubidium Flux
IC50 2500±n/a nM
Citation PubChem, PC Identification of Novel Modulators of Cl- dependent Transport Process via HTS: Rubidium Flux PubChem Bioassay(2009)[AID]
 
Solute carrier family 12 member 5
Name:Solute carrier family 12 member 5
Type:PROTEIN
Mol. Mass.:126185.18
Organism:Homo sapiens (Human)
Description:ChEMBL_828024
Residue:1139
BDBM43905
NameBDBM43905
Synonyms:2-chloranyl-5-[methyl-(phenylmethyl)sulfamoyl]-N-(2-pyridin-2-ylethyl)benzamide 5-[benzyl(methyl)sulfamoyl]-2-chloro-N-(2-pyridin-2-ylethyl)benzamide VU0287194-2-D22 | cid_2494801
TypeSmall organic molecule
Emp. Form.C22H22ClN3O3S
Mol. Mass.443.946
SMILESCN(Cc1ccccc1)S(=O)(=O)c1ccc(Cl)c(c1)C(=O)NCCc1ccccn1