Reaction Details
TargetSolute carrier family 12 member 5
LigandBDBM43906
Substrate/Competitorn/a
Meas. Tech.Identification of Novel Modulators of Cl- dependent Transport Process via HTS: Rubidium Flux
IC50 51000±n/a nM
Citation PubChem, PC Identification of Novel Modulators of Cl- dependent Transport Process via HTS: Rubidium Flux PubChem Bioassay(2009)[AID]
 
Solute carrier family 12 member 5
Name:Solute carrier family 12 member 5
Type:PROTEIN
Mol. Mass.:126185.18
Organism:Homo sapiens (Human)
Description:ChEMBL_828024
Residue:1139
BDBM43906
NameBDBM43906
Synonyms:(2-methyl-2,3-dihydroindol-1-yl)-(3-nitro-4-pyrrolidin-1-yl-phenyl)methanone (2-methyl-2,3-dihydroindol-1-yl)-[3-nitro-4-(1-pyrrolidinyl)phenyl]methanone VU0258186-2-D23 | cid_5046669
TypeSmall organic molecule
Emp. Form.C20H21N3O3
Mol. Mass.351.399
SMILESCC1Cc2ccccc2N1C(=O)c1ccc(N2CCCC2)c(c1)[N+]([O-])=O