Reaction Details
TargetSolute carrier family 12 member 5
LigandBDBM43909
Substrate/Competitorn/a
Meas. Tech.Identification of Novel Modulators of Cl- dependent Transport Process via HTS: Rubidium Flux
IC50 36000±n/a nM
Citation PubChem, PC Identification of Novel Modulators of Cl- dependent Transport Process via HTS: Rubidium Flux PubChem Bioassay(2009)[AID]
 
Solute carrier family 12 member 5
Name:Solute carrier family 12 member 5
Type:PROTEIN
Mol. Mass.:126185.18
Organism:Homo sapiens (Human)
Description:ChEMBL_828024
Residue:1139
BDBM43909
NameBDBM43909
Synonyms:3-[2-(1-naphthalenylmethylthio)-1-benzimidazolyl]propanoic acid 3-[2-(naphthalen-1-ylmethylsulfanyl)benzimidazol-1-yl]propanoic acid cid_1083479
TypeSmall organic molecule
Emp. Form.C21H18N2O2S
Mol. Mass.362.445
SMILESOC(=O)CCn1c(SCc2cccc3ccccc23)nc2ccccc12