Reaction Details
TargetSolute carrier family 12 member 5
LigandBDBM44020
Substrate/Competitorn/a
Meas. Tech.Identification of Novel Modulators of Cl- dependent Transport Process via HTS; Dose-dependent Assay with KCC2
EC50 24±n/a nM
Citation PubChem, PC Identification of Novel Modulators of Cl- dependent Transport Process via HTS; Dose-dependent Assay with KCC2 PubChem Bioassay(2009)[AID]
 
Solute carrier family 12 member 5
Name:Solute carrier family 12 member 5
Type:PROTEIN
Mol. Mass.:126185.18
Organism:Homo sapiens (Human)
Description:ChEMBL_828024
Residue:1139
BDBM44020
NameBDBM44020
Synonyms:MLS000547345 N'-(4-phenyl-1,3-thiazol-2-yl)benzohydrazide N'-(4-phenylthiazol-2-yl)benzohydrazide cid_1482007
TypeSmall organic molecule
Emp. Form.C16H13N3OS
Mol. Mass.295.359
SMILESO=C(NNc1nc(cs1)-c1ccccc1)c1ccccc1