Reaction Details
TargetSolute carrier family 12 member 5
LigandBDBM41369
Substrate/Competitorn/a
Meas. Tech.Identification of Novel Modulators of Cl- dependent Transport Process via HTS; Dose-dependent Assay with KCC2
EC50 2680±n/a nM
Citation PubChem, PC Identification of Novel Modulators of Cl- dependent Transport Process via HTS; Dose-dependent Assay with KCC2 PubChem Bioassay(2009)[AID]
 
Solute carrier family 12 member 5
Name:Solute carrier family 12 member 5
Type:PROTEIN
Mol. Mass.:126185.18
Organism:Homo sapiens (Human)
Description:ChEMBL_828024
Residue:1139
BDBM41369
NameBDBM41369
Synonyms:MLS000118132 N-[2-[4-(2-fluorophenyl)piperazin-1-yl]ethyl]-1,5-dimethyl-4-oxidanylidene-pyrrolo[3,2-c]quinoline-2-carboxamide N-[2-[4-(2-fluorophenyl)piperazino]ethyl]-4-keto-1,5-dimethyl-pyrrolo[3,2-c]quinoline-2-carboxamide cid_5308835
TypeSmall organic molecule
Emp. Form.C26H28FN5O2
Mol. Mass.461.5312
SMILESCn1c(cc2c1c1ccccc1n(C)c2=O)C(=O)NCCN1CCN(CC1)c1ccccc1F