Reaction Details
TargetSolute carrier family 12 member 5
LigandBDBM44000
Substrate/Competitorn/a
Meas. Tech.Identification of Novel Modulators of Cl- dependent Transport Process via HTS; Dose-dependent Assay with KCC2
EC50 153±n/a nM
Citation PubChem, PC Identification of Novel Modulators of Cl- dependent Transport Process via HTS; Dose-dependent Assay with KCC2 PubChem Bioassay(2009)[AID]
 
Solute carrier family 12 member 5
Name:Solute carrier family 12 member 5
Type:PROTEIN
Mol. Mass.:126185.18
Organism:Homo sapiens (Human)
Description:ChEMBL_828024
Residue:1139
BDBM44000
NameBDBM44000
Synonyms:MLS000558851 N-[(5Z)-5-(1H-benzimidazol-2-ylmethylidene)-4-oxidanylidene-2-sulfanylidene-1,3-thiazolidin-3-yl]-2-chloranyl-benzamide N-[(5Z)-5-(1H-benzimidazol-2-ylmethylidene)-4-oxo-2-sulfanylidene-3-thiazolidinyl]-2-chlorobenzamide SMR000149167 | cid_5607430
TypeSmall organic molecule
Emp. Form.C18H11ClN4O2S2
Mol. Mass.414.889
SMILESClc1ccccc1C(=O)NN1C(=S)S\C(=C/c2nc3ccccc3[nH]2)C1=O