Reaction Details
TargetSolute carrier family 12 member 5
LigandBDBM44222
Substrate/Competitorn/a
Meas. Tech.Identification of Novel Modulators of Cl- dependent Transport Process via HTS; Dose-dependent Assay with KCC2
EC50 46.5±n/a nM
Citation PubChem, PC Identification of Novel Modulators of Cl- dependent Transport Process via HTS; Dose-dependent Assay with KCC2 PubChem Bioassay(2009)[AID]
 
Solute carrier family 12 member 5
Name:Solute carrier family 12 member 5
Type:PROTEIN
Mol. Mass.:126185.18
Organism:Homo sapiens (Human)
Description:ChEMBL_828024
Residue:1139
BDBM44222
NameBDBM44222
Synonyms:5-(4-ethoxyanilino)-3H-1,3,4-thiadiazole-2-thione 5-[(4-ethoxyphenyl)amino]-3H-1,3,4-thiadiazole-2-thione SMR000264217 | cid_3721677
TypeSmall organic molecule
Emp. Form.C10H11N3OS2
Mol. Mass.253.344
SMILESCCOc1ccc(Nc2nnc(S)s2)cc1