Reaction Details
TargetSolute carrier family 12 member 5
LigandBDBM44145
Substrate/Competitorn/a
Meas. Tech.Identification of Novel Modulators of Cl- dependent Transport Process via HTS; Dose-dependent Assay with KCC2
EC50 67.6±n/a nM
Citation PubChem, PC Identification of Novel Modulators of Cl- dependent Transport Process via HTS; Dose-dependent Assay with KCC2 PubChem Bioassay(2009)[AID]
 
Solute carrier family 12 member 5
Name:Solute carrier family 12 member 5
Type:PROTEIN
Mol. Mass.:126185.18
Organism:Homo sapiens (Human)
Description:ChEMBL_828024
Residue:1139
BDBM44145
NameBDBM44145
Synonyms:2-chloranyl-N-[3-(dimethylsulfamoyl)phenyl]-5,5-bis(oxidanylidene)-8,9,10,11-tetrahydro-7H-azepino[2,1-c][1,2,4]benzothiadiazine-3-carboxamide 2-chloro-N-[3-(dimethylsulfamoyl)phenyl]-5,5-dioxo-8,9,10,11-tetrahydro-7H-azepino[2,1-c][1,2,4]benzothiadiazine-3-carboxamide SMR000370543 | cid_5025448
TypeSmall organic molecule
Emp. Form.C21H23ClN4O5S2
Mol. Mass.511.014
SMILESCN(C)S(=O)(=O)c1cccc(NC(=O)c2cc3c(cc2Cl)N2CCCCC=C2NS3(=O)=O)c1