Reaction Details
TargetSolute carrier family 12 member 5
LigandBDBM44168
Substrate/Competitorn/a
Meas. Tech.Identification of Novel Modulators of Cl- dependent Transport Process via HTS; Dose-dependent Assay with KCC2
EC50 291±n/a nM
Citation PubChem, PC Identification of Novel Modulators of Cl- dependent Transport Process via HTS; Dose-dependent Assay with KCC2 PubChem Bioassay(2009)[AID]
 
Solute carrier family 12 member 5
Name:Solute carrier family 12 member 5
Type:PROTEIN
Mol. Mass.:126185.18
Organism:Homo sapiens (Human)
Description:ChEMBL_828024
Residue:1139
BDBM44168
NameBDBM44168
Synonyms:3-(2-chlorophenyl)-5-methyl-N-(p-cumenylthiocarbamoyl)isoxazole-4-carboxamide 3-(2-chlorophenyl)-5-methyl-N-[(4-propan-2-ylphenyl)carbamothioyl]-1,2-oxazole-4-carboxamide N-{[3-(2-chlorophenyl)-5-methylisoxazol-4-yl]carbonyl}-N'-(4-isopropylphenyl)thiourea cid_2809351
TypeSmall organic molecule
Emp. Form.C21H20ClN3O2S
Mol. Mass.413.92
SMILESCC(C)c1ccc(NC(=S)NC(=O)c2c(C)onc2-c2ccccc2Cl)cc1