Reaction Details
TargetMuscarinic acetylcholine receptor M1
LigandBDBM43821
Substrate/Competitorn/a
Meas. Tech.Discovery of novel allosteric modulators of the M1 muscarinic receptor: Agonist Activity against Muscarinic Panel
EC50 152.3±n/a nM
Citation PubChem, PC Discovery of novel allosteric modulators of the M1 muscarinic receptor: Agonist Activity against Muscarinic Panel PubChem Bioassay(2009)[AID]
 
Muscarinic acetylcholine receptor M1
Name:Muscarinic acetylcholine receptor M1
Type:Enzyme Catalytic Domain
Mol. Mass.:51390.46
Organism:RAT
Description:P08482
Residue:460
BDBM43821
NameBDBM43821
Synonyms:4-(2-benzamidoethylamino)-1-piperidinecarboxylic acid ethyl ester;hydrochloride CHEMBL1609153 cid_25010774 | ethyl 4-(2-benzamidoethylamino)piperidine-1-carboxylate;hydrochloride
TypeSmall organic molecule
Emp. Form.C17H25N3O3
Mol. Mass.319.3987
SMILESCCOC(=O)N1CCC(CC1)NCCNC(=O)c1ccccc1