Reaction Details
TargetEphrin type-A receptor 4
LigandBDBM31698
Substrate/Competitorn/a
Meas. Tech.Colorimetric assay for HTS discovery of chemical inhibitors of EphA4 receptor antagonists
IC50 8980±n/a nM
Citation PubChem, PC Colorimetric assay for HTS discovery of chemical inhibitors of EphA4 receptor antagonists PubChem Bioassay(2008)[AID]
 
Ephrin type-A receptor 4
Name:Ephrin type-A receptor 4
Type:Enzyme Catalytic Domain
Mol. Mass.:109812.17
Organism:Mus musculus
Description:gi_34328113
Residue:986
BDBM31698
NameBDBM31698
Synonyms:3-bromanyl-5-(3,3-dimethylpiperidin-1-yl)carbonyl-pyran-2-one 3-bromo-5-[(3,3-dimethyl-1-piperidinyl)-oxomethyl]-2-pyranone SMR000044848 | cid_664033
TypeSmall organic molecule
Emp. Form.C13H16BrNO3
Mol. Mass.314.175
SMILESCC1(C)CCCN(C1)C(=O)c1coc(=O)c(Br)c1