Reaction Details
TargetEphrin type-A receptor 4
LigandBDBM44469
Substrate/Competitorn/a
Meas. Tech.Colorimetric assay for HTS discovery of chemical inhibitors of EphA4 receptor antagonists
IC50 21300±n/a nM
Citation PubChem, PC Colorimetric assay for HTS discovery of chemical inhibitors of EphA4 receptor antagonists PubChem Bioassay(2008)[AID]
 
Ephrin type-A receptor 4
Name:Ephrin type-A receptor 4
Type:Enzyme Catalytic Domain
Mol. Mass.:109812.17
Organism:Mus musculus
Description:gi_34328113
Residue:986
BDBM44469
NameBDBM44469
Synonyms:2,3-bis(2-furanyl)-N-(2-phenylethyl)-6-quinoxalinecarboxamide 2,3-bis(furan-2-yl)-N-(2-phenylethyl)quinoxaline-6-carboxamide SMR000131061 | cid_5076888
TypeSmall organic molecule
Emp. Form.C25H19N3O3
Mol. Mass.409.4367
SMILESO=C(NCCc1ccccc1)c1ccc2nc(-c3ccco3)c(nc2c1)-c1ccco1