Reaction Details
TargetEphrin type-A receptor 4
LigandBDBM31751
Substrate/Competitorn/a
Meas. Tech.Counter Screen for Placental Alkaline Phosphatase-based Assays Positives
IC50>50000±0 nM
Citation PubChem, PC Counter Screen for Placental Alkaline Phosphatase-based Assays Positives PubChem Bioassay(2008)[AID]
 
Ephrin type-A receptor 4
Name:Ephrin type-A receptor 4
Type:Enzyme Catalytic Domain
Mol. Mass.:109812.17
Organism:Mus musculus
Description:gi_34328113
Residue:986
BDBM31751
NameBDBM31751
Synonyms:3-[(2-chlorobenzyl)thio]-5,6-bis(2-furyl)-1,2,4-triazine 3-[(2-chlorophenyl)methylthio]-5,6-bis(2-furanyl)-1,2,4-triazine cid_6400942
TypeSmall organic molecule
Emp. Form.C18H12ClN3O2S
Mol. Mass.369.825
SMILESClc1ccccc1CSc1nnc(-c2ccco2)c(n1)-c1ccco1