Reaction Details
TargetProtein Rev [8-24]
LigandBDBM44536
Substrate/Competitorn/a
Meas. Tech.Dose response biochemical assay to identify inhibitors of the HIV Rev - RRE RNA interaction (disruption of protein-RNA interaction)
IC50>79370±n/a nM
Citation PubChem, PC Dose response biochemical assay to identify inhibitors of the HIV Rev - RRE RNA interaction (disruption of protein-RNA interaction) PubChem Bioassay(2007)[AID]
 
Protein Rev [8-24]
Name:Protein Rev [8-24]
Type:Enzyme Catalytic Domain
Mol. Mass.:2446.81
Organism:Human immunodeficiency virus 1
Description:gi_253722402
Residue:17
TRQARRNRRRRWRERQR
BDBM44536
NameBDBM44536
Synonyms:4-[4-[3-(dimethylamino)-2-hydroxy-propoxy]phenyl]benzonitrile 4-[4-[3-(dimethylamino)-2-oxidanyl-propoxy]phenyl]benzenecarbonitrile SMR000041957 | cid_661384
TypeSmall organic molecule
Emp. Form.C18H20N2O2
Mol. Mass.296.3636
SMILESCN(C)CC(O)COc1ccc(cc1)-c1ccc(cc1)C#N