Reaction Details
TargetProtein Rev [8-24]
LigandBDBM43572
Substrate/Competitorn/a
Meas. Tech.Dose response biochemical assay to identify inhibitors of the HIV Rev - RRE RNA interaction (disruption of protein-RNA interaction)
IC50 2471±n/a nM
Citation PubChem, PC Dose response biochemical assay to identify inhibitors of the HIV Rev - RRE RNA interaction (disruption of protein-RNA interaction) PubChem Bioassay(2007)[AID]
 
Protein Rev [8-24]
Name:Protein Rev [8-24]
Type:Enzyme Catalytic Domain
Mol. Mass.:2446.81
Organism:Human immunodeficiency virus 1
Description:gi_253722402
Residue:17
TRQARRNRRRRWRERQR
BDBM43572
NameBDBM43572
Synonyms:(4'-amino-3,3'-diethoxy-4-biphenylyl)amine 4-(4-azanyl-3-ethoxy-phenyl)-2-ethoxy-aniline SMR000079128 cid_974772
TypeSmall organic molecule
Emp. Form.C16H20N2O2
Mol. Mass.272.3422
SMILESCCOc1cc(ccc1N)-c1ccc(N)c(OCC)c1