Reaction Details
TargetProtein Rev [8-24]
LigandBDBM44552
Substrate/Competitorn/a
Meas. Tech.Dose response biochemical assay to identify inhibitors of the HIV Rev - RRE RNA interaction (disruption of protein-RNA interaction)
IC50>79370±n/a nM
Citation PubChem, PC Dose response biochemical assay to identify inhibitors of the HIV Rev - RRE RNA interaction (disruption of protein-RNA interaction) PubChem Bioassay(2007)[AID]
 
Protein Rev [8-24]
Name:Protein Rev [8-24]
Type:Enzyme Catalytic Domain
Mol. Mass.:2446.81
Organism:Human immunodeficiency virus 1
Description:gi_253722402
Residue:17
TRQARRNRRRRWRERQR
BDBM44552
NameBDBM44552
Synonyms:3-(4-Chloro-phenyl)-9-methyl-2H-1-thia-4,4a-diaza-9-azonia-fluorene MLS000552347 cid_11958731
TypeSmall organic molecule
Emp. Form.C16H13ClN3S
Mol. Mass.314.812
SMILESC[n+]1c2SCC(=Nn2c2ccccc12)c1ccc(Cl)cc1