Reaction Details
TargetProtein Rev [8-24]
LigandBDBM44554
Substrate/Competitorn/a
Meas. Tech.Dose response biochemical assay to identify inhibitors of the HIV Rev - RRE RNA interaction (disruption of protein-RNA interaction)
IC50 2861±n/a nM
Citation PubChem, PC Dose response biochemical assay to identify inhibitors of the HIV Rev - RRE RNA interaction (disruption of protein-RNA interaction) PubChem Bioassay(2007)[AID]
 
Protein Rev [8-24]
Name:Protein Rev [8-24]
Type:Enzyme Catalytic Domain
Mol. Mass.:2446.81
Organism:Human immunodeficiency virus 1
Description:gi_253722402
Residue:17
TRQARRNRRRRWRERQR
BDBM44554
NameBDBM44554
Synonyms:(4E)-4-[4-(dimethylamino)benzylidene]-3-methyl-2-isoxazolin-5-one (4E)-4-[[4-(dimethylamino)phenyl]methylidene]-3-methyl-5-isoxazolone MLS000576042 cid_5333448
TypeSmall organic molecule
Emp. Form.C13H14N2O2
Mol. Mass.230.2625
SMILESCN(C)c1ccc(\C=C2\C(=O)ON=C2C)cc1