Reaction Details
TargetCoagulation factor XII
LigandBDBM32824
Substrate/Competitorn/a
Meas. Tech.Factor XIIa 1536 HTS Dose Response Confirmation
IC50 375.646667±21.215825 nM
Citation PubChem, PC Factor XIIa 1536 HTS Dose Response Confirmation PubChem Bioassay(2008)[AID]
 
Coagulation factor XII
Name:Coagulation factor XII
Type:Enzyme
Mol. Mass.:67810.07
Organism:Homo sapiens (Human)
Description:P00748
Residue:615
BDBM32824
NameBDBM32824
Synonyms:(3-Amino-[1,2,4]triazol-4-yl)-(3,5-dimethoxy-phenyl)-methanone (3-azanyl-1,2,4-triazol-4-yl)-(3,5-dimethoxyphenyl)methanone SMR000148302 | cid_936917
TypeSmall organic molecule
Emp. Form.C11H12N4O3
Mol. Mass.248.238
SMILESCOc1cc(OC)cc(c1)C(=O)n1cnnc1N