Reaction Details
TargetCoagulation factor XII
LigandBDBM33716
Substrate/Competitorn/a
Meas. Tech.Factor XIIa 1536 HTS Dose Response Confirmation
IC50 945.193333±88.060542 nM
Citation PubChem, PC Factor XIIa 1536 HTS Dose Response Confirmation PubChem Bioassay(2008)[AID]
 
Coagulation factor XII
Name:Coagulation factor XII
Type:Enzyme
Mol. Mass.:67810.07
Organism:Homo sapiens (Human)
Description:P00748
Residue:615
BDBM33716
NameBDBM33716
Synonyms:2-[(5-benzamido-1H-1,2,4-triazol-3-yl)thio]acetic acid ethyl ester SMR000180812 ethyl 2-[(5-benzamido-1H-1,2,4-triazol-3-yl)sulfanyl]acetate ethyl 2-{[3-(benzoylamino)-1H-1,2,4-triazol-5-yl]sulfanyl}acetate
TypeSmall organic molecule
Emp. Form.C13H14N4O3S
Mol. Mass.306.34
SMILESCCOC(=O)CSc1nnc(NC(=O)c2ccccc2)[nH]1