Reaction Details
TargetCoagulation factor XII
LigandBDBM50314728
Substrate/Competitorn/a
Meas. Tech.Factor XIIa 1536 HTS Dose Response Confirmation
IC50 573.893333±56.039469 nM
Citation PubChem, PC Factor XIIa 1536 HTS Dose Response Confirmation PubChem Bioassay(2008)[AID]
 
Coagulation factor XII
Name:Coagulation factor XII
Type:Enzyme
Mol. Mass.:67810.07
Organism:Homo sapiens (Human)
Description:P00748
Residue:615
BDBM50314728
NameBDBM50314728
Synonyms:4-(4-methoxybenzoyloxyimino)-2,6-dimethylcyclohexa-2,5-dienone cid_710899
TypeSmall organic molecule
Emp. Form.C16H15NO4
Mol. Mass.285.2946
SMILES[#6]-[#8]-c1ccc(cc1)-[#6](=O)-[#8]\[#7]=[#6]-1/[#6]=[#6](-[#6])-[#6](=O)-[#6](-[#6])=[#6]-1