Reaction Details
TargetCoagulation factor XII
LigandBDBM45636
Substrate/Competitorn/a
Meas. Tech.Factor XIIa 1536 HTS Dose Response Confirmation
IC50 236.593333±34.886247 nM
Citation PubChem, PC Factor XIIa 1536 HTS Dose Response Confirmation PubChem Bioassay(2008)[AID]
 
Coagulation factor XII
Name:Coagulation factor XII
Type:Enzyme
Mol. Mass.:67810.07
Organism:Homo sapiens (Human)
Description:P00748
Residue:615
BDBM45636
NameBDBM45636
Synonyms:MLS000708241 [5-amino-3-(2-furanyl)-1,2,4-triazol-1-yl]-(4-fluorophenyl)methanone [5-amino-3-(furan-2-yl)-1,2,4-triazol-1-yl]-(4-fluorophenyl)methanone cid_828589
TypeSmall organic molecule
Emp. Form.C13H9FN4O2
Mol. Mass.272.2346
SMILESNc1nc(nn1C(=O)c1ccc(F)cc1)-c1ccco1