Reaction Details
TargetCoagulation factor XII
LigandBDBM45651
Substrate/Competitorn/a
Meas. Tech.Factor XIIa 1536 HTS Dose Response Confirmation
IC50 49.483333±5.099258 nM
Citation PubChem, PC Factor XIIa 1536 HTS Dose Response Confirmation PubChem Bioassay(2008)[AID]
 
Coagulation factor XII
Name:Coagulation factor XII
Type:Enzyme
Mol. Mass.:67810.07
Organism:Homo sapiens (Human)
Description:P00748
Residue:615
BDBM45651
NameBDBM45651
Synonyms:(6-methyl-3-nitro-2-oxidanylidene-1H-pyridin-4-yl) (E)-3-(3,4-dimethoxyphenyl)prop-2-enoate (E)-3-(3,4-dimethoxyphenyl)-2-propenoic acid (6-methyl-3-nitro-2-oxo-1H-pyridin-4-yl) ester MLS000685020 cid_7150694
TypeSmall organic molecule
Emp. Form.C17H16N2O7
Mol. Mass.360.3181
SMILESCOc1ccc(\C=C\C(=O)Oc2cc(C)[nH]c(=O)c2[N+]([O-])=O)cc1OC