Reaction Details
TargetCoagulation factor XII
LigandBDBM32934
Substrate/Competitorn/a
Meas. Tech.Factor XIIa 1536 HTS Dose Response Confirmation
IC50 454.613333±75.196735 nM
Citation PubChem, PC Factor XIIa 1536 HTS Dose Response Confirmation PubChem Bioassay(2008)[AID]
 
Coagulation factor XII
Name:Coagulation factor XII
Type:Enzyme
Mol. Mass.:67810.07
Organism:Homo sapiens (Human)
Description:P00748
Residue:615
BDBM32934
NameBDBM32934
Synonyms:MLS000419584 N-([1,3]dioxolo[4,5-f][1,3]benzothiazol-6-yl)-2-furancarboxamide SMR000320301 | cid_7202802
TypeSmall organic molecule
Emp. Form.C13H8N2O4S
Mol. Mass.288.279
SMILESO=C(Nc1nc2cc3OCOc3cc2s1)c1ccco1