Reaction Details
TargetTyrosine-protein phosphatase non-receptor type 7
LigandBDBM45791
Substrate/Competitorn/a
Meas. Tech.Fluorescent secondary assay for dose-response confirmation of chemical inhibitors of HePTP
IC50>100000±n/a nM
Citation PubChem, PC Fluorescent secondary assay for dose-response confirmation of chemical inhibitors of HePTP PubChem Bioassay(2009)[AID]
 
Tyrosine-protein phosphatase non-receptor type 7
Name:Tyrosine-protein phosphatase non-receptor type 7
Type:Protein
Mol. Mass.:40530.79
Organism:Homo sapiens (Human)
Description:P35236
Residue:360
BDBM45791
NameBDBM45791
Synonyms:4-(1,3-dioxo-2-isoindolyl)benzoic acid 4-[1,3-bis(oxidanylidene)isoindol-2-yl]benzoic acid MLS-0091937.0001 | cid_246499
TypeSmall organic molecule
Emp. Form.C15H9NO4
Mol. Mass.267.2363
SMILESOC(=O)c1ccc(cc1)N1C(=O)c2ccccc2C1=O