Reaction Details
TargetTyrosine-protein phosphatase non-receptor type 7
LigandBDBM31735
Substrate/Competitorn/a
Meas. Tech.Fluorescent secondary assay for dose-response confirmation of chemical inhibitors of HePTP
IC50 949±n/a nM
Citation PubChem, PC Fluorescent secondary assay for dose-response confirmation of chemical inhibitors of HePTP PubChem Bioassay(2009)[AID]
 
Tyrosine-protein phosphatase non-receptor type 7
Name:Tyrosine-protein phosphatase non-receptor type 7
Type:Protein
Mol. Mass.:40530.79
Organism:Homo sapiens (Human)
Description:P35236
Residue:360
BDBM31735
NameBDBM31735
Synonyms:(7Z)-3-bromanyl-7-(furan-2-ylmethylidene)-[1,3]thiazolo[4,5]imidazo[1,2-b]pyridin-8-one (7Z)-3-bromo-7-(2-furfurylidene)thiazolo[4,5]imidazo[1,2-b]pyridin-8-one MLS-0091940.0001 | cid_6456506
TypeSmall organic molecule
Emp. Form.C13H6BrN3O2S
Mol. Mass.348.175
SMILESBrc1cnc2c(c1)nc1s\c(=C/c3ccco3)c(=O)n21