Reaction Details
TargetTyrosine-protein phosphatase non-receptor type 7
LigandBDBM31750
Substrate/Competitorn/a
Meas. Tech.Fluorescent secondary assay for dose-response confirmation of chemical inhibitors of HePTP
IC50 2840±n/a nM
Citation PubChem, PC Fluorescent secondary assay for dose-response confirmation of chemical inhibitors of HePTP PubChem Bioassay(2009)[AID]
 
Tyrosine-protein phosphatase non-receptor type 7
Name:Tyrosine-protein phosphatase non-receptor type 7
Type:Protein
Mol. Mass.:40530.79
Organism:Homo sapiens (Human)
Description:P35236
Residue:360
BDBM31750
NameBDBM31750
Synonyms:5,6-bis(2-furanyl)-3-(methylthio)-1,2,4-triazine 5,6-bis(furan-2-yl)-3-methylsulfanyl-1,2,4-triazine cid_3053058
TypeSmall organic molecule
Emp. Form.C12H9N3O2S
Mol. Mass.259.284
SMILESCSc1nnc(-c2ccco2)c(n1)-c1ccco1