Reaction Details
TargetTyrosine-protein phosphatase non-receptor type 7
LigandBDBM46210
Substrate/Competitorn/a
Meas. Tech.Fluorescent secondary assay for dose-response confirmation of chemical inhibitors of HePTP
IC50 8460±n/a nM
Citation PubChem, PC Fluorescent secondary assay for dose-response confirmation of chemical inhibitors of HePTP PubChem Bioassay(2009)[AID]
 
Tyrosine-protein phosphatase non-receptor type 7
Name:Tyrosine-protein phosphatase non-receptor type 7
Type:Protein
Mol. Mass.:40530.79
Organism:Homo sapiens (Human)
Description:P35236
Residue:360
BDBM46210
NameBDBM46210
Synonyms:4-(1,3-benzodioxol-5-ylmethyl)-N-(4-sulfamoylphenyl)-1-piperazinecarbothioamide 4-piperonyl-N-(4-sulfamoylphenyl)piperazine-1-carbothioamide cid_1213466
TypeSmall organic molecule
Emp. Form.C19H22N4O4S2
Mol. Mass.434.532
SMILESNS(=O)(=O)c1ccc(NC(=S)N2CCN(Cc3ccc4OCOc4c3)CC2)cc1