Reaction Details
TargetTyrosine-protein phosphatase non-receptor type 7
LigandBDBM46227
Substrate/Competitorn/a
Meas. Tech.Fluorescent secondary assay for dose-response confirmation of chemical inhibitors of HePTP
IC50 1380±n/a nM
Citation PubChem, PC Fluorescent secondary assay for dose-response confirmation of chemical inhibitors of HePTP PubChem Bioassay(2009)[AID]
 
Tyrosine-protein phosphatase non-receptor type 7
Name:Tyrosine-protein phosphatase non-receptor type 7
Type:Protein
Mol. Mass.:40530.79
Organism:Homo sapiens (Human)
Description:P35236
Residue:360
BDBM46227
NameBDBM46227
Synonyms:MLS-0312434.0001 | cid_4969416
TypeSmall organic molecule
Emp. Form.C23H18N2O5S2
Mol. Mass.466.529
SMILESOC(=O)CSc1cc(cn2c1nc1sc3CCCCc3c1c2=O)C(=O)c1ccccc1O