Reaction Details
TargetTyrosine-protein phosphatase non-receptor type 7
LigandBDBM46245
Substrate/Competitorn/a
Meas. Tech.Fluorescent secondary assay for dose-response confirmation of chemical inhibitors of HePTP
IC50 16665±n/a nM
Citation PubChem, PC Fluorescent secondary assay for dose-response confirmation of chemical inhibitors of HePTP PubChem Bioassay(2009)[AID]
 
Tyrosine-protein phosphatase non-receptor type 7
Name:Tyrosine-protein phosphatase non-receptor type 7
Type:Protein
Mol. Mass.:40530.79
Organism:Homo sapiens (Human)
Description:P35236
Residue:360
BDBM46245
NameBDBM46245
Synonyms:4-keto-5-methyl-2-[(E)-2-(4-methyl-3-nitro-phenyl)vinyl]-3H-thieno[2,3-d]pyrimidine-6-carboxylic acid 5-methyl-2-[(E)-2-(4-methyl-3-nitrophenyl)ethenyl]-4-oxo-3H-thieno[2,3-d]pyrimidine-6-carboxylic acid cid_8853383
TypeSmall organic molecule
Emp. Form.C17H13N3O5S
Mol. Mass.371.367
SMILESCc1c(sc2nc(C=Cc3ccc(C)c(c3)[N+]([O-])=O)[nH]c(=O)c12)C(O)=O