Reaction Details
TargetTyrosine-protein phosphatase non-receptor type 7
LigandBDBM46247
Substrate/Competitorn/a
Meas. Tech.Fluorescent secondary assay for dose-response confirmation of chemical inhibitors of HePTP
IC50 924±n/a nM
Citation PubChem, PC Fluorescent secondary assay for dose-response confirmation of chemical inhibitors of HePTP PubChem Bioassay(2009)[AID]
 
Tyrosine-protein phosphatase non-receptor type 7
Name:Tyrosine-protein phosphatase non-receptor type 7
Type:Protein
Mol. Mass.:40530.79
Organism:Homo sapiens (Human)
Description:P35236
Residue:360
BDBM46247
NameBDBM46247
Synonyms:2-[4-[(E)-[[4-[2-(4-chloroanilino)-1,3-thiazol-4-yl]benzoyl]hydrazinylidene]methyl]phenoxy]acetic acid 2-[4-[(E)-[[4-[2-[(4-chlorophenyl)amino]-1,3-thiazol-4-yl]phenyl]carbonylhydrazinylidene]methyl]phenoxy]ethanoic acid MLS-0312565.0001 | cid_9595032
TypeSmall organic molecule
Emp. Form.C25H19ClN4O4S
Mol. Mass.506.961
SMILESOC(=O)COc1ccc(\C=N\NC(=O)c2ccc(cc2)-c2csc(Nc3ccc(Cl)cc3)n2)cc1