Reaction Details
TargetHeat shock cognate 71 kDa protein
LigandBDBM31723
Substrate/Competitorn/a
Meas. Tech.In Vitro Hsc70 Dose Response Fluorescence Polarization Assay
IC50 48400±5700 nM
Citation PubChem, PC In Vitro Hsc70 Dose Response Fluorescence Polarization Assay PubChem Bioassay(2008)[AID]
 
Heat shock cognate 71 kDa protein
Name:Heat shock cognate 71 kDa protein
Type:Enzyme Catalytic Domain
Mol. Mass.:70887.67
Organism:Homo sapiens (Human)
Description:gi_5729877
Residue:646
BDBM31723
NameBDBM31723
Synonyms:8-nitro-3a,4,5,9b-tetrahydro-3H-cyclopenta[c]quinoline-4-carboxylic acid cid_3112185
TypeSmall organic molecule
Emp. Form.C13H12N2O4
Mol. Mass.260.2454
SMILESOC(=O)C1Nc2ccc(cc2C2C=CCC12)[N+]([O-])=O